Reaction Details
TargetEctonucleotide pyrophosphatase/phosphodiesterase family member 2
LigandBDBM50332919
Substrate/Competitorn/a
Meas. Tech.ChEMBL_694283 (CHEMBL1637645)
Ki 5300±n/a nM
Citation East, JEKennedy, AJTomsig, JLDe Leon, ARLynch, KRMacdonald, TL Synthesis and structure-activity relationships of tyrosine-based inhibitors of autotaxin (ATX). Bioorg Med Chem Lett20:7132-6 (2010) 
 
Ectonucleotide pyrophosphatase/phosphodiesterase family member 2
Name:Ectonucleotide pyrophosphatase/phosphodiesterase family member 2
Type:Enzyme
Mol. Mass.:99007.13
Organism:Homo sapiens (Human)
Description:Q13822
Residue:863
BDBM50332919
NameBDBM50332919
Synonyms:CHEMBL1629746 anti-(3S)-2-hydroxy-4-(4-(4-methoxy-3,5-dimethylbenzyloxy)phenyl)-3-palmitamidobutylphosphonic acid
TypeSmall organic molecule
Emp. Form.C36H58NO7P
Mol. Mass.647.822
(=O)N[C@@H](Cc1ccc(OCc2cc(C)c(OC)c(C)c2)cc1)C(=O)CP(O)(O)O