Reaction Details
TargetEctonucleotide pyrophosphatase/phosphodiesterase family member 2
LigandBDBM50332907
Substrate/Competitorn/a
Meas. Tech.ChEMBL_694283 (CHEMBL1637645)
Ki 3900±n/a nM
Citation East, JEKennedy, AJTomsig, JLDe Leon, ARLynch, KRMacdonald, TL Synthesis and structure-activity relationships of tyrosine-based inhibitors of autotaxin (ATX). Bioorg Med Chem Lett20:7132-6 (2010) 
 
Ectonucleotide pyrophosphatase/phosphodiesterase family member 2
Name:Ectonucleotide pyrophosphatase/phosphodiesterase family member 2
Type:Enzyme
Mol. Mass.:99007.13
Organism:Homo sapiens (Human)
Description:Q13822
Residue:863
BDBM50332907
NameBDBM50332907
Synonyms:CHEMBL1632529 anti-(3S)-4-(4-((3,5-dimethylpyridin-2-yl)methoxy)phenyl)-2-hydroxy-3-palmitamidobutylphosphonic acid
TypeSmall organic molecule
Emp. Form.C34H55N2O6P
Mol. Mass.618.7841
(=O)N[C@@H](Cc1ccc(OCc2ncc(C)cc2C)cc1)C(=O)CP(O)(O)O