Reaction Details
TargetEctonucleotide pyrophosphatase/phosphodiesterase family member 2
LigandBDBM50332905
Substrate/Competitorn/a
Meas. Tech.ChEMBL_694283 (CHEMBL1637645)
Ki 1500±n/a nM
Citation East, JEKennedy, AJTomsig, JLDe Leon, ARLynch, KRMacdonald, TL Synthesis and structure-activity relationships of tyrosine-based inhibitors of autotaxin (ATX). Bioorg Med Chem Lett20:7132-6 (2010) 
 
Ectonucleotide pyrophosphatase/phosphodiesterase family member 2
Name:Ectonucleotide pyrophosphatase/phosphodiesterase family member 2
Type:Enzyme
Mol. Mass.:99007.13
Organism:Homo sapiens (Human)
Description:Q13822
Residue:863
BDBM50332905
NameBDBM50332905
Synonyms:CHEMBL1632527 anti-(3S)-2-hydroxy-4-(4-((4-methoxypyridin-2-yl)methoxy)phenyl)-3-palmitamidobutylphosphonic acid
TypeSmall organic molecule
Emp. Form.C33H53N2O7P
Mol. Mass.620.7569
(=O)N[C@@H](Cc1ccc(OCc2cc(OC)ccn2)cc1)C(=O)CP(O)(O)O