Reaction Details
TargetEctonucleotide pyrophosphatase/phosphodiesterase family member 2
LigandBDBM50332903
Substrate/Competitorn/a
Meas. Tech.ChEMBL_694283 (CHEMBL1637645)
Ki 11000±n/a nM
Citation East, JEKennedy, AJTomsig, JLDe Leon, ARLynch, KRMacdonald, TL Synthesis and structure-activity relationships of tyrosine-based inhibitors of autotaxin (ATX). Bioorg Med Chem Lett20:7132-6 (2010) 
 
Ectonucleotide pyrophosphatase/phosphodiesterase family member 2
Name:Ectonucleotide pyrophosphatase/phosphodiesterase family member 2
Type:Enzyme
Mol. Mass.:99007.13
Organism:Homo sapiens (Human)
Description:Q13822
Residue:863
BDBM50332903
NameBDBM50332903
Synonyms:CHEMBL1632525 anti-(3S)-2-hydroxy-3-palmitamido-4-(4-(pyridin-2-ylmethoxy)phenyl)butylphosphonic acid
TypeSmall organic molecule
Emp. Form.C32H51N2O6P
Mol. Mass.590.7309
(=O)N[C@@H](Cc1ccc(OCc2ccccn2)cc1)C(=O)CP(O)(O)O