Reaction Details
TargetEctonucleotide pyrophosphatase/phosphodiesterase family member 2
LigandBDBM50332913
Substrate/Competitorn/a
Meas. Tech.ChEMBL_694283 (CHEMBL1637645)
Ki 11600±n/a nM
Citation East, JEKennedy, AJTomsig, JLDe Leon, ARLynch, KRMacdonald, TL Synthesis and structure-activity relationships of tyrosine-based inhibitors of autotaxin (ATX). Bioorg Med Chem Lett20:7132-6 (2010) 
 
Ectonucleotide pyrophosphatase/phosphodiesterase family member 2
Name:Ectonucleotide pyrophosphatase/phosphodiesterase family member 2
Type:Enzyme
Mol. Mass.:99007.13
Organism:Homo sapiens (Human)
Description:Q13822
Residue:863
BDBM50332913
NameBDBM50332913
Synonyms:CHEMBL1632610 anti-(3S)-2-hydroxy-3-palmitamido-4-(4-((4-(2,2,2-trifluoroethoxy)pyridin-2-yl)methoxy)phenyl)butylphosphonic acid
TypeSmall organic molecule
Emp. Form.C34H52F3N2O7P
Mol. Mass.688.7549
(=O)N[C@@H](Cc1ccc(OCc2cc(OCC(F)(F)F)ccn2)cc1)C(=O)CP(O)(O)O