Reaction Details
TargetEctonucleotide pyrophosphatase/phosphodiesterase family member 2
LigandBDBM50332928
Substrate/Competitorn/a
Meas. Tech.ChEMBL_694284 (CHEMBL1637646)
Ki 40100±n/a nM
Citation East, JEKennedy, AJTomsig, JLDe Leon, ARLynch, KRMacdonald, TL Synthesis and structure-activity relationships of tyrosine-based inhibitors of autotaxin (ATX). Bioorg Med Chem Lett20:7132-6 (2010) 
 
Ectonucleotide pyrophosphatase/phosphodiesterase family member 2
Name:Ectonucleotide pyrophosphatase/phosphodiesterase family member 2
Type:Enzyme
Mol. Mass.:99007.13
Organism:Homo sapiens (Human)
Description:Q13822
Residue:863
BDBM50332928
NameBDBM50332928
Synonyms:(3S)-1-bromo-3-hydroxy-4-(stearoyloxy)butylphosphonic acid | CHEMBL1632624
TypeSmall organic molecule
Emp. Form.C22H44BrO6P
Mol. Mass.515.459
(=O)OC[C@@H](O)CC(Br)P(O)(O)=O