Reaction Details
TargetThymidylate kinase
LigandBDBM50332930
Substrate/Competitorn/a
Meas. Tech.ChEMBL_694285 (CHEMBL1637647)
Ki 420±n/a nM
Citation Familiar, OMunier-Lehmann, HAínsa, JACamarasa, MJPérez-Pérez, MJ Design, synthesis and inhibitory activity against Mycobacterium tuberculosis thymidine monophosphate kinase of acyclic nucleoside analogues with a distal imidazoquinolinone. Eur J Med Chem45:5910-8 (2010) 
 
Thymidylate kinase
Name:Thymidylate kinase
Type:PROTEIN
Mol. Mass.:22636.29
Organism:Mycobacterium tuberculosis
Description:ChEMBL_208218
Residue:214
BDBM50332930
NameBDBM50332930
Synonyms:5-methyl-1-(4-(2-oxobenzo[cd]indol-1(2H)-yl)but-2-enyl)pyrimidine-2,4(1H,3H)-dione | CHEMBL1632625
TypeSmall organic molecule
Emp. Form.C20H17N3O3
Mol. Mass.347.3673
SMILESCc1cn(C\C=C\CN2C(=O)c3cccc4cccc2c34)c(=O)[nH]c1=O