Reaction Details
TargetThymidylate kinase
LigandBDBM50332931
Substrate/Competitorn/a
Meas. Tech.ChEMBL_694285 (CHEMBL1637647)
Ki 270±n/a nM
Citation Familiar, OMunier-Lehmann, HAínsa, JACamarasa, MJPérez-Pérez, MJ Design, synthesis and inhibitory activity against Mycobacterium tuberculosis thymidine monophosphate kinase of acyclic nucleoside analogues with a distal imidazoquinolinone. Eur J Med Chem45:5910-8 (2010) 
 
Thymidylate kinase
Name:Thymidylate kinase
Type:PROTEIN
Mol. Mass.:22636.29
Organism:Mycobacterium tuberculosis
Description:ChEMBL_208218
Residue:214
BDBM50332931
NameBDBM50332931
Synonyms:1-[4-(1,1-Dioxo-1H-1lambda-6-naphtho[1,8-cd]isothiazol-2-yl)-but-2-enyl]-5-methyl-1H-pyrimidine-2,4-dione | CHEMBL1632626
TypeSmall organic molecule
Emp. Form.C19H17N3O4S
Mol. Mass.383.421
SMILESCc1cn(C\C=C\CN2c3cccc4cccc(c34)S2(=O)=O)c(=O)[nH]c1=O