Reaction Details
TargetThymidylate kinase
LigandBDBM50332932
Substrate/Competitorn/a
Meas. Tech.ChEMBL_694285 (CHEMBL1637647)
Ki 1160±n/a nM
Citation Familiar, OMunier-Lehmann, HAínsa, JACamarasa, MJPérez-Pérez, MJ Design, synthesis and inhibitory activity against Mycobacterium tuberculosis thymidine monophosphate kinase of acyclic nucleoside analogues with a distal imidazoquinolinone. Eur J Med Chem45:5910-8 (2010) 
 
Thymidylate kinase
Name:Thymidylate kinase
Type:PROTEIN
Mol. Mass.:22636.29
Organism:Mycobacterium tuberculosis
Description:ChEMBL_208218
Residue:214
BDBM50332932
NameBDBM50332932
Synonyms:5-methyl-1-(4-(2-oxo-2,4,5,6-tetrahydro-1H-imidazo[4,5,1-ij]quinolin-1-yl)but-2-enyl)pyrimidine-2,4(1H,3H)-dione | CHEMBL1632627
TypeSmall organic molecule
Emp. Form.C19H20N4O3
Mol. Mass.352.3871
SMILESCc1cn(C\C=C\Cn2c3cccc4CCCn(c34)c2=O)c(=O)[nH]c1=O