Reaction Details
TargetMetabotropic glutamate receptor 2
LigandBDBM50332971
Substrate/Competitorn/a
Meas. Tech.ChEMBL_696215 (CHEMBL1639368)
IC50 4±n/a nM
Citation Woltering, TJWichmann, JGoetschi, EKnoflach, FBallard, TMHuwyler, JGatti, S Synthesis and characterization of 1,3-dihydro-benzo[b][1,4]diazepin-2-one derivatives: Part 4. In vivo active potent and selective non-competitive metabotropic glutamate receptor 2/3 antagonists. Bioorg Med Chem Lett20:6969-74 (2010) 
 
Metabotropic glutamate receptor 2
Name:Metabotropic glutamate receptor 2
Type:Enzyme
Mol. Mass.:95584.88
Organism:Homo sapiens (Human)
Description:Q14416
Residue:872
BDBM50332971
NameBDBM50332971
Synonyms:4-(3-(2-isopropylpyridin-4-yl)phenyl)-7-methyl-8-(trifluoromethyl)-1H-benzo[b][1,4]diazepin-2(3H)-one | CHEMBL1631864
TypeSmall organic molecule
Emp. Form.C25H22F3N3O
Mol. Mass.437.4569
SMILESCC(C)c1cc(ccn1)-c1cccc(c1)C1=Nc2cc(C)c(cc2NC(=O)C1)C(F)(F)F