Reaction Details
TargetMetabotropic glutamate receptor 2
LigandBDBM50332977
Substrate/Competitorn/a
Meas. Tech.ChEMBL_696216 (CHEMBL1639369)
IC50 5±n/a nM
Citation Woltering, TJWichmann, JGoetschi, EKnoflach, FBallard, TMHuwyler, JGatti, S Synthesis and characterization of 1,3-dihydro-benzo[b][1,4]diazepin-2-one derivatives: Part 4. In vivo active potent and selective non-competitive metabotropic glutamate receptor 2/3 antagonists. Bioorg Med Chem Lett20:6969-74 (2010) 
 
Metabotropic glutamate receptor 2
Name:Metabotropic glutamate receptor 2
Type:Enzyme
Mol. Mass.:95584.88
Organism:Homo sapiens (Human)
Description:Q14416
Residue:872
BDBM50332977
NameBDBM50332977
Synonyms:7-methyl-4-(3-(6-methylpyridin-3-yl)phenyl)-8-(trifluoromethyl)-1H-benzo[b][1,4]diazepin-2(3H)-one | CHEMBL1629845
TypeSmall organic molecule
Emp. Form.C23H18F3N3O
Mol. Mass.409.4037
SMILESCc1ccc(cn1)-c1cccc(c1)C1=Nc2cc(C)c(cc2NC(=O)C1)C(F)(F)F