Reaction Details
TargetMetabotropic glutamate receptor 2
LigandBDBM50332980
Substrate/Competitorn/a
Meas. Tech.ChEMBL_696215 (CHEMBL1639368)
IC50 6±n/a nM
Citation Woltering, TJWichmann, JGoetschi, EKnoflach, FBallard, TMHuwyler, JGatti, S Synthesis and characterization of 1,3-dihydro-benzo[b][1,4]diazepin-2-one derivatives: Part 4. In vivo active potent and selective non-competitive metabotropic glutamate receptor 2/3 antagonists. Bioorg Med Chem Lett20:6969-74 (2010) 
 
Metabotropic glutamate receptor 2
Name:Metabotropic glutamate receptor 2
Type:Enzyme
Mol. Mass.:95584.88
Organism:Homo sapiens (Human)
Description:Q14416
Residue:872
BDBM50332980
NameBDBM50332980
Synonyms:7-methyl-4-(3-(pyrimidin-4-yl)phenyl)-8-(trifluoromethyl)-1H-benzo[b][1,4]diazepin-2(3H)-one | CHEMBL1629852
TypeSmall organic molecule
Emp. Form.C21H15F3N4O
Mol. Mass.396.3652
SMILESCc1cc2N=C(CC(=O)Nc2cc1C(F)(F)F)c1cccc(c1)-c1ccncn1