Reaction Details
TargetMetabotropic glutamate receptor 2
LigandBDBM50332983
Substrate/Competitorn/a
Meas. Tech.ChEMBL_696215 (CHEMBL1639368)
IC50 7±n/a nM
Citation Woltering, TJWichmann, JGoetschi, EKnoflach, FBallard, TMHuwyler, JGatti, S Synthesis and characterization of 1,3-dihydro-benzo[b][1,4]diazepin-2-one derivatives: Part 4. In vivo active potent and selective non-competitive metabotropic glutamate receptor 2/3 antagonists. Bioorg Med Chem Lett20:6969-74 (2010) 
 
Metabotropic glutamate receptor 2
Name:Metabotropic glutamate receptor 2
Type:Enzyme
Mol. Mass.:95584.88
Organism:Homo sapiens (Human)
Description:Q14416
Residue:872
BDBM50332983
NameBDBM50332983
Synonyms:4-(3-(2,6-dimethylpyridin-4-yl)phenyl)-7,8-bis(trifluoromethyl)-1H-benzo[b][1,4]diazepin-2(3H)-one | CHEMBL1629860
TypeSmall organic molecule
Emp. Form.C24H17F6N3O
Mol. Mass.477.4017
SMILESCc1cc(cc(C)n1)-c1cccc(c1)C1=Nc2cc(c(cc2NC(=O)C1)C(F)(F)F)C(F)(F)F