Reaction Details
TargetXanthine dehydrogenase/oxidase
LigandBDBM50333143
Substrate/Competitorn/a
Meas. Tech.ChEMBL_701314 (CHEMBL1648934)
IC50 623±n/a nM
Citation Sathisha, KRKhanum, SAChandra, JNAyisha, FBalaji, SMarathe, GKGopal, SRangappa, KS Synthesis and xanthine oxidase inhibitory activity of 7-methyl-2-(phenoxymethyl)-5H-[1,3,4]thiadiazolo[3,2-a]pyrimidin-5-one derivatives. Bioorg Med Chem19:211-20 (2011) 
 
Xanthine dehydrogenase/oxidase
Name:Xanthine dehydrogenase/oxidase
Type:PROTEIN
Mol. Mass.:146252.77
Organism:Rattus norvegicus
Description:ChEMBL_1296864
Residue:1331
BDBM50333143
NameBDBM50333143
Synonyms:2-((4-chloro-3-methylphenoxy)methyl)-7-methyl-5H-[1,3,4]thiadiazolo[3,2-a]pyrimidin-5-one | CHEMBL1644706
TypeSmall organic molecule
Emp. Form.C14H12ClN3O2S
Mol. Mass.321.782
SMILESCc1cc(=O)n2nc(COc3ccc(Cl)c(C)c3)sc2n1