Reaction Details
TargetXanthine dehydrogenase/oxidase
LigandBDBM50333145
Substrate/Competitorn/a
Meas. Tech.ChEMBL_701314 (CHEMBL1648934)
IC50 2030±n/a nM
Citation Sathisha, KRKhanum, SAChandra, JNAyisha, FBalaji, SMarathe, GKGopal, SRangappa, KS Synthesis and xanthine oxidase inhibitory activity of 7-methyl-2-(phenoxymethyl)-5H-[1,3,4]thiadiazolo[3,2-a]pyrimidin-5-one derivatives. Bioorg Med Chem19:211-20 (2011) 
 
Xanthine dehydrogenase/oxidase
Name:Xanthine dehydrogenase/oxidase
Type:PROTEIN
Mol. Mass.:146252.77
Organism:Rattus norvegicus
Description:ChEMBL_1296864
Residue:1331
BDBM50333145
NameBDBM50333145
Synonyms:7-methyl-2-((4-nitrophenoxy)methyl)-5H-[1,3,4]thiadiazolo[3,2-a]pyrimidin-5-one | CHEMBL1644711
TypeSmall organic molecule
Emp. Form.C13H10N4O4S
Mol. Mass.318.308
SMILESCc1cc(=O)n2nc(COc3ccc(cc3)[N+]([O-])=O)sc2n1