Reaction Details
TargetGalactofuranosyltransferase GlfT2
LigandBDBM50333187
Substrate/Competitorn/a
Meas. Tech.ChEMBL_698125 (CHEMBL1646238)
IC50 332000±n/a nM
Citation Vembaiyan, KPearcey, JABhasin, MLowary, TLZou, W Synthesis of sugar-amino acid-nucleosides as potential glycosyltransferase inhibitors. Bioorg Med Chem19:58-66 (2011) 
 
Galactofuranosyltransferase GlfT2
Name:Galactofuranosyltransferase GlfT2
Type:PROTEIN
Mol. Mass.:71513.75
Organism:Mycobacterium tuberculosis
Description:ChEMBL_698125
Residue:637
BDBM50333187
NameBDBM50333187
Synonyms:5'-N-[N-alpha-(2,6-Anhydro-D-glycero-L-gluco-heptit-1-yl-acetamido)-histidinamido]-5'-deoxy-uridine | CHEMBL1644891
TypeSmall organic molecule
Emp. Form.C23H32N6O12
Mol. Mass.584.5332
SMILESOC[C@H]1O[C@H](CC(=O)N[C@@H](Cc2cnc[nH]2)C(=O)NC[C@H]2O[C@H]([C@H](O)[C@@H]2O)n2ccc(=O)[nH]c2=O)[C@H](O)[C@@H](O)[C@H]1O