Reaction Details
TargetPhosphatidylinositol 4,5-bisphosphate 3-kinase catalytic subunit beta isoform
LigandBDBM50333219
Substrate/Competitorn/a
Meas. Tech.ChEMBL_698256 (CHEMBL1646726)
IC50 3600±n/a nM
Citation Giordanetto, FKull, BDellsén, A Discovery of novel class 1 phosphatidylinositide 3-kinases (PI3K) fragment inhibitors through structure-based virtual screening. Bioorg Med Chem Lett21:829-35 (2011) 
 
Phosphatidylinositol 4,5-bisphosphate 3-kinase catalytic subunit beta isoform
Name:Phosphatidylinositol 4,5-bisphosphate 3-kinase catalytic subunit beta isoform
Type:Enzyme Subunit
Mol. Mass.:122769.00
Organism:Homo sapiens (Human)
Description:P42338
Residue:1070
BDBM50333219
NameBDBM50333219
Synonyms:6-(6-methoxypyridin-3-yl)benzo[d]thiazol-2-amine | CHEMBL1645105
TypeSmall organic molecule
Emp. Form.C13H11N3OS
Mol. Mass.257.311
SMILESCOc1ccc(cn1)-c1ccc2nc(N)sc2c1