Reaction Details
TargetMetabotropic glutamate receptor 1
LigandBDBM50163592
Substrate/Competitorn/a
Meas. Tech.ChEMBL_698433 (CHEMBL1647365)
Ki 0.340000±n/a nM
Citation Fujinaga, MYamasaki, TKawamura, KKumata, KHatori, AYui, JYanamoto, KYoshida, YOgawa, MNengaki, NMaeda, JFukumura, TZhang, MR Synthesis and evaluation of 6-[1-(2-[(18)F]fluoro-3-pyridyl)-5-methyl-1H-1,2,3-triazol-4-yl]quinoline for positron emission tomography imaging of the metabotropic glutamate receptor type 1 in brain. Bioorg Med Chem19:102-10 (2011) 
 
Metabotropic glutamate receptor 1
Name:Metabotropic glutamate receptor 1
Type:Enzyme
Mol. Mass.:132358.19
Organism:Homo sapiens (Human)
Description:Q13255
Residue:1194
BDBM50163592
NameBDBM50163592
Synonyms:(3,4-Dihydro-2H-1-oxa-9-aza-anthracen-6-yl)-(4-methoxy-cyclohexyl)-methanone | CHEMBL174588
TypeSmall organic molecule
Emp. Form.C20H23NO3
Mol. Mass.325.4015
SMILESCO[C@H]1CC[C@H](CC1)C(=O)c1ccc2nc3OCCCc3cc2c1