Reaction Details
TargetAmine oxidase [flavin-containing] A
LigandBDBM50333417
Substrate/Competitorn/a
Meas. Tech.ChEMBL_698696 (CHEMBL1648260)
Ki 28±n/a nM
Citation Reniers, JRobert, SFrederick, RMasereel, BVincent, SWouters, J Synthesis and evaluation ofß-carboline derivatives as potential monoamine oxidase inhibitors. Bioorg Med Chem19:134-44 (2011) 
 
Amine oxidase [flavin-containing] A
Name:Amine oxidase [flavin-containing] A
Type:Protein
Mol. Mass.:59689.53
Organism:Homo sapiens (Human)
Description:P21397
Residue:527
BDBM50333417
NameBDBM50333417
Synonyms:2-(1-Methyl-9H-beta-carbolin-7-yloxy)-ethanol CHEMBL14355
TypeSmall organic molecule
Emp. Form.C14H14N2O2
Mol. Mass.242.2732
SMILESCc1nccc2c3ccc(OCCO)cc3[nH]c12