Reaction Details
TargetAmine oxidase [flavin-containing] A
LigandBDBM50333421
Substrate/Competitorn/a
Meas. Tech.ChEMBL_698696 (CHEMBL1648260)
Ki 5±n/a nM
Citation Reniers, JRobert, SFrederick, RMasereel, BVincent, SWouters, J Synthesis and evaluation ofß-carboline derivatives as potential monoamine oxidase inhibitors. Bioorg Med Chem19:134-44 (2011) 
 
Amine oxidase [flavin-containing] A
Name:Amine oxidase [flavin-containing] A
Type:Protein
Mol. Mass.:59689.53
Organism:Homo sapiens (Human)
Description:P21397
Residue:527
BDBM50333421
NameBDBM50333421
Synonyms:7-(Phenethoxy)-1-methyl-beta-carboline | CHEMBL1645550
TypeSmall organic molecule
Emp. Form.C20H18N2O
Mol. Mass.302.3697
SMILESCc1nccc2c3ccc(OCCc4ccccc4)cc3[nH]c12