Reaction Details
TargetCarbonic anhydrase 2
LigandBDBM10890
Substrate/Competitorn/a
Meas. Tech.ChEMBL_700656 (CHEMBL1645695)
Ki 15±n/a nM
Citation Bertucci, AInnocenti, AScozzafava, ATambutté, SZoccola, DSupuran, CT Carbonic anhydrase inhibitors. Inhibition studies with anions and sulfonamides of a new cytosolic enzyme from the scleractinian coral Stylophora pistillata. Bioorg Med Chem Lett21:710-4 (2011) 
 
Carbonic anhydrase 2
Name:Carbonic anhydrase 2
Type:Enzyme
Mol. Mass.:29250.71
Organism:Homo sapiens (Human)
Description:P00918
Residue:260
BDBM10890
NameBDBM10890
Synonyms:1-N-(3-chloro-1H-indol-7-yl)benzene-1,4-disulfonamide Compound 6 Indisulam (IND) | Sulfonamide, 7
TypeSmall organic molecule
Emp. Form.C14H12ClN3O4S2
Mol. Mass.385.846
SMILESNS(=O)(=O)c1ccc(cc1)S(=O)(=O)Nc1cccc2c(Cl)c[nH]c12