Reaction Details
TargetCarbonic anhydrase
LigandBDBM10872
Substrate/Competitorn/a
Meas. Tech.ChEMBL_700659 (CHEMBL1645698)
Ki 902±n/a nM
Citation Bertucci, AInnocenti, AScozzafava, ATambutté, SZoccola, DSupuran, CT Carbonic anhydrase inhibitors. Inhibition studies with anions and sulfonamides of a new cytosolic enzyme from the scleractinian coral Stylophora pistillata. Bioorg Med Chem Lett21:710-4 (2011) 
 
Carbonic anhydrase
Name:Carbonic anhydrase
Synonyms:n/a
Type:PROTEIN
Mol. Mass.:35119.71
Organism:Stylophora pistillata
Description:ChEMBL_700659
Residue:316
BDBM10872
NameBDBM10872
TypeSmall organic molecule
Emp. Form.C14H17N3O4S2
Mol. Mass.355.432
SMILESNc1ccc(cc1)S(=O)(=O)NCCc1ccc(cc1)S(N)(=O)=O