Reaction Details
TargetCarbonic anhydrase
LigandBDBM26979
Substrate/Competitorn/a
Meas. Tech.ChEMBL_700658 (CHEMBL1645697)
Ki 500000±n/a nM
Citation Bertucci, AInnocenti, AScozzafava, ATambutté, SZoccola, DSupuran, CT Carbonic anhydrase inhibitors. Inhibition studies with anions and sulfonamides of a new cytosolic enzyme from the scleractinian coral Stylophora pistillata. Bioorg Med Chem Lett21:710-4 (2011) 
 
Carbonic anhydrase
Name:Carbonic anhydrase
Synonyms:Alpha carbonic anhydrase
Type:PROTEIN
Mol. Mass.:36650.57
Organism:Stylophora pistillata
Description:ChEMBL_700658
Residue:323
BDBM26979
NameBDBM26979
TypeIon
Emp. Form.Cl
Mol. Mass.35.454
SMILES[Cl-]