Reaction Details
TargetGroup 10 secretory phospholipase A2
LigandBDBM50333789
Substrate/Competitorn/a
Meas. Tech.ChEMBL_700977 (CHEMBL1648032)
IC50>1660±n/a nM
Citation Mouchlis, VDMagrioti, VBarbayianni, ECermak, NOslund, RCMavromoustakos, TMGelb, MHKokotos, G Inhibition of secreted phospholipases A2 by 2-oxoamides based ona-amino acids: Synthesis, in vitro evaluation and molecular docking calculations. Bioorg Med Chem19:735-43 (2011) 
 
Group 10 secretory phospholipase A2
Name:Group 10 secretory phospholipase A2
Type:PROTEIN
Mol. Mass.:18153.11
Organism:Homo sapiens (Human)
Description:ChEMBL_1442449
Residue:165
BDBM50333789
NameBDBM50333789
Synonyms:(R)-4-Methyl-2-(2-oxohexadecanamido)pentanoic acid | CHEMBL1644550
TypeSmall organic molecule
Emp. Form.C22H41NO4
Mol. Mass.383.5652
(=O)C(=O)N[C@H](CC(C)C)C(O)=O