Reaction Details
TargetPhospholipase A2, membrane associated
LigandBDBM50333792
Substrate/Competitorn/a
Meas. Tech.ChEMBL_700973 (CHEMBL1648028)
IC50 4200±n/a nM
Citation Mouchlis, VDMagrioti, VBarbayianni, ECermak, NOslund, RCMavromoustakos, TMGelb, MHKokotos, G Inhibition of secreted phospholipases A2 by 2-oxoamides based ona-amino acids: Synthesis, in vitro evaluation and molecular docking calculations. Bioorg Med Chem19:735-43 (2011) 
 
Phospholipase A2, membrane associated
Name:Phospholipase A2, membrane associated
Type:Hydrolase
Mol. Mass.:16101.20
Organism:Homo sapiens (Human)
Description:The human nps PLA2 was cloned, and expressed in E. coli. There was a refolding process in the purification.
Residue:144
BDBM50333792
NameBDBM50333792
Synonyms:2-(2-Oxohexadecanamido)acetic acid . | CHEMBL1644546
TypeSmall organic molecule
Emp. Form.C18H33NO4
Mol. Mass.327.4589
(=O)C(=O)NCC(O)=O