Reaction Details
TargetThioredoxin reductase 1, cytoplasmic
LigandBDBM50085551
Substrate/Competitorn/a
Meas. Tech.ChEMBL_700048 (CHEMBL1646825)
IC50 180000±n/a nM
Citation Sorrentino, FKarioti, AGratteri, PRigobello, MPScutari, GMessori, LBindoli, AChioccioli, MGabbiani, CBergonzi, MCBilia, AR Hypericins and thioredoxin reductase: Biochemical and docking studies disclose the molecular basis for effective inhibition by naphthodianthrones. Bioorg Med Chem19:631-41 (2011) 
 
Thioredoxin reductase 1, cytoplasmic
Name:Thioredoxin reductase 1, cytoplasmic
Type:PROTEIN
Mol. Mass.:54519.34
Organism:Rattus norvegicus
Description:ChEMBL_589950
Residue:498
BDBM50085551
NameBDBM50085551
Synonyms:1,8-Dihydroxy-3-hydroxymethyl-anthraquinone CHEMBL40275 aloe-emodin | cid_10207
TypeSmall organic molecule
Emp. Form.C15H10O5
Mol. Mass.270.2369
SMILESOCc1cc(O)c2C(=O)c3c(O)cccc3C(=O)c2c1