Reaction Details
TargetCathepsin D
LigandBDBM50333947
Substrate/Competitorn/a
Meas. Tech.ChEMBL_700285 (CHEMBL1647503)
Ki 1700±n/a nM
Citation Sund, CBelda, OWiktelius, DSahlberg, CVrang, LSedig, SHamelink, EHenderson, IAgback, TJansson, KBorkakoti, NDerbyshire, DEneroth, ASamuelsson, B Design and synthesis of potent macrocyclic renin inhibitors. Bioorg Med Chem Lett21:358-62 (2010) 
 
Cathepsin D
Name:Cathepsin D
Type:Enzyme
Mol. Mass.:44551.72
Organism:Homo sapiens (Human)
Description:Human proCathepsin D (SwissProt accession number P07339) was expressed in Sf9 cells, purified, and autoactivated.
Residue:412
BDBM50333947
NameBDBM50333947
Synonyms:(S)-2-{(S)-2-Hydroxy-2-[(S)-18-(methanesulfonyl-methyl-amino)-2,15-dioxo-4-phenyl-11-oxa-3,14-diaza-tricyclo[14.3.1.1*5,9*]henicosa-1(20),5,7,9(21),16,18-hexaen-13-yl]-ethyl}-3,N-dimethyl-butyramide | CHEMBL1644465
TypeSmall organic molecule
Emp. Form.C34H42N4O7S
Mol. Mass.650.785
SMILESCNC(=O)[C@@H](C[C@H](O)[C@@H]1COCc2cccc(c2)C(NC(=O)c2cc(cc(c2)C(=O)N1)N(C)S(C)(=O)=O)c1ccccc1)C(C)C