Reaction Details
TargetCathepsin D
LigandBDBM50333949
Substrate/Competitorn/a
Meas. Tech.ChEMBL_700285 (CHEMBL1647503)
Ki 460±n/a nM
Citation Sund, CBelda, OWiktelius, DSahlberg, CVrang, LSedig, SHamelink, EHenderson, IAgback, TJansson, KBorkakoti, NDerbyshire, DEneroth, ASamuelsson, B Design and synthesis of potent macrocyclic renin inhibitors. Bioorg Med Chem Lett21:358-62 (2010) 
 
Cathepsin D
Name:Cathepsin D
Type:Enzyme
Mol. Mass.:44551.72
Organism:Homo sapiens (Human)
Description:Human proCathepsin D (SwissProt accession number P07339) was expressed in Sf9 cells, purified, and autoactivated.
Residue:412
BDBM50333949
NameBDBM50333949
Synonyms:(S)-2-{(S)-2-Hydroxy-2-[(S)-18-(methanesulfonyl-methyl-amino)-4-(3-methoxy-propyl)-2,15-dioxo-11-oxa-3,14-diaza-tricyclo[14.3.1.1*5,9*]henicosa-1(20),5,7,9(21),16,18-hexaen-13-yl]-ethyl}-N-isobutyl-3-methyl-butyramide | CHEMBL1644467
TypeSmall organic molecule
Emp. Form.C35H52N4O8S
Mol. Mass.688.874
SMILESCOCCCC1NC(=O)c2cc(cc(c2)C(=O)N[C@@H](COCc2cccc1c2)[C@@H](O)C[C@@H](C(C)C)C(=O)NCC(C)C)N(C)S(C)(=O)=O