Reaction Details
TargetPeroxisome proliferator-activated receptor delta
LigandBDBM28706
Substrate/Competitorn/a
Meas. Tech.ChEMBL_700495 (CHEMBL1648154)
EC50 2600±n/a nM
Citation Sakuma, SEndo, TKanda, TNakamura, HYamasaki, SYamakawa, T Synthesis of a novel human PPARd selective agonist and its stimulatory effect on oligodendrocyte differentiation. Bioorg Med Chem Lett21:240-4 (2010) 
 
Peroxisome proliferator-activated receptor delta
Name:Peroxisome proliferator-activated receptor delta
Type:Enzyme
Mol. Mass.:49910.45
Organism:Homo sapiens (Human)
Description:Q03181
Residue:441
BDBM28706
NameBDBM28706
Synonyms:2-methyl-2-phenoxypropanoic acid, 25a CHEMBL219586
TypeSmall organic molecule
Emp. Form.C23H21F3N2O4S
Mol. Mass.478.484
SMILESCc1nc(sc1C(=O)NCc1ccc(OC(C)(C)C(O)=O)cc1)-c1ccc(cc1)C(F)(F)F