Reaction Details
TargetSigma non-opioid intracellular receptor 1
LigandBDBM50334159
Substrate/Competitorn/a
Meas. Tech.ChEMBL_698206 (CHEMBL1646511)
Ki 1.5±n/a nM
Citation Maestrup, EGWiese, CSchepmann, DBrust, PWünsch, B Synthesis, pharmacological activity and structure affinity relationships of spirocyclics(1) receptor ligands with a (2-fluoroethyl) residue in 3-position. Bioorg Med Chem19:393-405 (2011) 
 
Sigma non-opioid intracellular receptor 1
Name:Sigma non-opioid intracellular receptor 1
Type:Protein
Mol. Mass.:25307.17
Organism:Cavia porcellus (Guinea pig)
Description:Q60492
Residue:223
BDBM50334159
NameBDBM50334159
Synonyms:CHEMBL1645203 | [2-(1'-Benzyl-3H-spiro[[2]benzofuran-1,4'-piperidin]-3-yl)-ethyl]p-Toluenesulfonate
TypeSmall organic molecule
Emp. Form.C28H31NO4S
Mol. Mass.477.615
SMILESCc1ccc(cc1)S(=O)(=O)OCCC1OC2(CCN(Cc3ccccc3)CC2)c2ccccc12