Reaction Details
TargetSigma non-opioid intracellular receptor 1
LigandBDBM50334168
Substrate/Competitorn/a
Meas. Tech.ChEMBL_698206 (CHEMBL1646511)
Ki 3.9±n/a nM
Citation Maestrup, EGWiese, CSchepmann, DBrust, PWünsch, B Synthesis, pharmacological activity and structure affinity relationships of spirocyclics(1) receptor ligands with a (2-fluoroethyl) residue in 3-position. Bioorg Med Chem19:393-405 (2011) 
 
Sigma non-opioid intracellular receptor 1
Name:Sigma non-opioid intracellular receptor 1
Type:Protein
Mol. Mass.:25307.17
Organism:Cavia porcellus (Guinea pig)
Description:Q60492
Residue:223
BDBM50334168
NameBDBM50334168
Synonyms:1'-Butyl-3-(2-fluoroethyl)-3H-spiro[[2]benzofuran-1,4'-piperidine] | CHEMBL1645212
TypeSmall organic molecule
Emp. Form.C18H26FNO
Mol. Mass.291.4035
SMILESCCCCN1CCC2(CC1)OC(CCF)c1ccccc21