Reaction Details
TargetCalmodulin-1
LigandBDBM26664
Substrate/Competitorn/a
Meas. Tech.ChEMBL_698552 (CHEMBL1647727)
IC50 37100±n/a nM
Citation Torres-Piedra, MFigueroa, MHernández-Abreu, OIbarra-Barajas, MNavarrete-Vázquez, GEstrada-Soto, S Vasorelaxant effect of flavonoids through calmodulin inhibition: Ex vivo, in vitro, and in silico approaches. Bioorg Med Chem19:542-6 (2011) 
 
Calmodulin-1
Name:Calmodulin-1
Type:Protein
Mol. Mass.:16813.73
Organism:Human
Description:P0DP23
Residue:149
BDBM26664
NameBDBM26664
Synonyms:7-Hydroxy-flavone, 5a 7-hydroxy-2-phenyl-4H-chromen-4-one CHEMBL276915
TypeFlavonoid
Emp. Form.C15H10O3
Mol. Mass.238.2381
SMILESOc1ccc2c(c1)oc(cc2=O)-c1ccccc1