Reaction Details
TargetAlpha-2A adrenergic receptor
LigandBDBM50334194
Substrate/Competitorn/a
Meas. Tech.ChEMBL_698563 (CHEMBL1647738)
EC50 82±n/a nM
Citation Saczewski, FKornicka, AHudson, ALLaird, SScheinin, MLaurila, JMRybczynska, ABoblewski, KLehmann, AGdaniec, M 3-[(Imidazolidin-2-yl)imino]indazole ligands with selectivity for thea(2)-adrenoceptor compared to the imidazoline I(1) receptor. Bioorg Med Chem19:321-9 (2011) 
 
Alpha-2A adrenergic receptor
Name:Alpha-2A adrenergic receptor
Type:Enzyme
Mol. Mass.:48979.91
Organism:Homo sapiens (Human)
Description:P08913
Residue:465
BDBM50334194
NameBDBM50334194
Synonyms:3-[(Imidazolidin-2-yl)imino]indazole hydrochloride | CHEMBL1641679
TypeSmall organic molecule
Emp. Form.C10H11N5
Mol. Mass.201.2278
SMILESC1CNC(N1)=Nc1[nH]nc2ccccc12