Reaction Details
TargetBeta-carbonic anhydrase 1
LigandBDBM50334353
Substrate/Competitorn/a
Meas. Tech.ChEMBL_700107 (CHEMBL1646989)
Ki 315±n/a nM
Citation Pacchiano, FCarta, FVullo, DScozzafava, ASupuran, CT Inhibition ofß-carbonic anhydrases with ureido-substituted benzenesulfonamides. Bioorg Med Chem Lett21:102-5 (2010) 
 
Beta-carbonic anhydrase 1
Name:Beta-carbonic anhydrase 1
Type:Enzyme
Mol. Mass.:18186.06
Organism:Mycobacterium tuberculosis
Description:The recombinant GST-mtCA1 construct was cloned, expressed, and further purified from E. coli. The purified protein was used in inhibition assays.
Residue:163
BDBM50334353
NameBDBM50334353
Synonyms:4-(3-(3,5-dimethylphenyl)ureido)benzenesulfonamide CHEMBL1643306
TypeSmall organic molecule
Emp. Form.C15H17N3O3S
Mol. Mass.319.379
SMILESCc1cc(C)cc(NC(=O)Nc2ccc(cc2)S(N)(=O)=O)c1