Reaction Details
TargetBeta-carbonic anhydrase 1
LigandBDBM50334359
Substrate/Competitorn/a
Meas. Tech.ChEMBL_700107 (CHEMBL1646989)
Ki 473±n/a nM
Citation Pacchiano, FCarta, FVullo, DScozzafava, ASupuran, CT Inhibition ofß-carbonic anhydrases with ureido-substituted benzenesulfonamides. Bioorg Med Chem Lett21:102-5 (2010) 
 
Beta-carbonic anhydrase 1
Name:Beta-carbonic anhydrase 1
Type:Enzyme
Mol. Mass.:18186.06
Organism:Mycobacterium tuberculosis
Description:The recombinant GST-mtCA1 construct was cloned, expressed, and further purified from E. coli. The purified protein was used in inhibition assays.
Residue:163
BDBM50334359
NameBDBM50334359
Synonyms:4-(3-(2-methoxyphenyl)ureido)benzenesulfonamide CHEMBL1643294
TypeSmall organic molecule
Emp. Form.C14H15N3O4S
Mol. Mass.321.352
SMILESCOc1ccccc1NC(=O)Nc1ccc(cc1)S(N)(=O)=O