Reaction Details
TargetCarbonic anhydrase
LigandBDBM50334354
Substrate/Competitorn/a
Meas. Tech.ChEMBL_700108 (CHEMBL1646990)
Ki 53±n/a nM
Citation Pacchiano, FCarta, FVullo, DScozzafava, ASupuran, CT Inhibition ofß-carbonic anhydrases with ureido-substituted benzenesulfonamides. Bioorg Med Chem Lett21:102-5 (2010) 
 
Carbonic anhydrase
Name:Carbonic anhydrase
Synonyms:PROBABLE TRANSMEMBRANE CARBONIC ANHYDRASE (CARBONATE DEHYDRATASE) (CARBONIC DEHYDRATASE)
Type:PROTEIN
Mol. Mass.:80567.22
Organism:Mycobacterium tuberculosis
Description:ChEMBL_878775
Residue:764
BDBM50334354
NameBDBM50334354
TypeSmall organic molecule
Emp. Form.C13H12FN3O3S
Mol. Mass.309.316
SMILESNS(=O)(=O)c1ccc(NC(=O)Nc2ccc(F)cc2)cc1