Reaction Details
TargetCarbonic anhydrase
LigandBDBM50334358
Substrate/Competitorn/a
Meas. Tech.ChEMBL_700108 (CHEMBL1646990)
Ki 481±n/a nM
Citation Pacchiano, FCarta, FVullo, DScozzafava, ASupuran, CT Inhibition ofß-carbonic anhydrases with ureido-substituted benzenesulfonamides. Bioorg Med Chem Lett21:102-5 (2010) 
 
Carbonic anhydrase
Name:Carbonic anhydrase
Synonyms:PROBABLE TRANSMEMBRANE CARBONIC ANHYDRASE (CARBONATE DEHYDRATASE) (CARBONIC DEHYDRATASE)
Type:PROTEIN
Mol. Mass.:80567.22
Organism:Mycobacterium tuberculosis
Description:ChEMBL_878775
Residue:764
BDBM50334358
NameBDBM50334358
TypeSmall organic molecule
Emp. Form.C15H11F6N3O3S
Mol. Mass.427.322
SMILESNS(=O)(=O)c1ccc(NC(=O)Nc2cc(cc(c2)C(F)(F)F)C(F)(F)F)cc1