Reaction Details
TargetCarbonic anhydrase
LigandBDBM50334346
Substrate/Competitorn/a
Meas. Tech.ChEMBL_700108 (CHEMBL1646990)
Ki 463±n/a nM
Citation Pacchiano, FCarta, FVullo, DScozzafava, ASupuran, CT Inhibition ofß-carbonic anhydrases with ureido-substituted benzenesulfonamides. Bioorg Med Chem Lett21:102-5 (2010) 
 
Carbonic anhydrase
Name:Carbonic anhydrase
Synonyms:PROBABLE TRANSMEMBRANE CARBONIC ANHYDRASE (CARBONATE DEHYDRATASE) (CARBONIC DEHYDRATASE)
Type:PROTEIN
Mol. Mass.:80567.22
Organism:Mycobacterium tuberculosis
Description:ChEMBL_878775
Residue:764
BDBM50334346
NameBDBM50334346
TypeSmall organic molecule
Emp. Form.C14H12N4O3S
Mol. Mass.316.335
SMILESNS(=O)(=O)c1ccc(NC(=O)Nc2ccccc2C#N)cc1