Reaction Details
TargetCarbonic anhydrase
LigandBDBM50334352
Substrate/Competitorn/a
Meas. Tech.ChEMBL_700108 (CHEMBL1646990)
Ki 733±n/a nM
Citation Pacchiano, FCarta, FVullo, DScozzafava, ASupuran, CT Inhibition ofß-carbonic anhydrases with ureido-substituted benzenesulfonamides. Bioorg Med Chem Lett21:102-5 (2010) 
 
Carbonic anhydrase
Name:Carbonic anhydrase
Synonyms:PROBABLE TRANSMEMBRANE CARBONIC ANHYDRASE (CARBONATE DEHYDRATASE) (CARBONIC DEHYDRATASE)
Type:PROTEIN
Mol. Mass.:80567.22
Organism:Mycobacterium tuberculosis
Description:ChEMBL_878775
Residue:764
BDBM50334352
NameBDBM50334352
TypeSmall organic molecule
Emp. Form.C12H17N3O3S
Mol. Mass.283.347
SMILESNS(=O)(=O)c1ccc(NC(=O)NC2CCCC2)cc1