Reaction Details
TargetNeuronal acetylcholine receptor subunit alpha-6
LigandBDBM50334469
Substrate/Competitorn/a
Meas. Tech.ChEMBL_701134 (CHEMBL1648232)
IC50 56±n/a nM
Citation Zhang, ZZheng, GPivavarchyk, MDeaciuc, AGDwoskin, LPCrooks, PA Novel bis-, tris-, and tetrakis-tertiary amino analogs as antagonists at neuronal nicotinic receptors that mediate nicotine-evoked dopamine release. Bioorg Med Chem Lett21:88-91 (2010) 
 
Neuronal acetylcholine receptor subunit alpha-6
Name:Neuronal acetylcholine receptor subunit alpha-6
Type:PROTEIN
Mol. Mass.:56943.53
Organism:Rattus norvegicus
Description:ChEMBL_1454451
Residue:493
BDBM50334469
NameBDBM50334469
Synonyms:2,2',2'',2'''-(5,5',5'',5'''-(benzene-1,2,4,5-tetrayl)tetrakis(pentane-5,1-diyl))tetraisoquinolinium bromide tri(2,2',2'',2'''-(5,5',5'',5'''-(benzene-1,2,4,5-tetrayl)tetrakis(pentane-5,1-diyl))tetraisoquinolinium)tetrabromide
TypeSmall organic molecule
Emp. Form.C62H70N4
Mol. Mass.871.2438
SMILESC(CCc1cc(CCCCC[n+]2ccc3ccccc3c2)c(CCCCC[n+]2ccc3ccccc3c2)cc1CCCCC[n+]1ccc2ccccc2c1)CC[n+]1ccc2ccccc2c1