Reaction Details
TargetNeuronal acetylcholine receptor subunit alpha-6
LigandBDBM50334474
Substrate/Competitorn/a
Meas. Tech.ChEMBL_701134 (CHEMBL1648232)
IC50 3±n/a nM
Citation Zhang, ZZheng, GPivavarchyk, MDeaciuc, AGDwoskin, LPCrooks, PA Novel bis-, tris-, and tetrakis-tertiary amino analogs as antagonists at neuronal nicotinic receptors that mediate nicotine-evoked dopamine release. Bioorg Med Chem Lett21:88-91 (2010) 
 
Neuronal acetylcholine receptor subunit alpha-6
Name:Neuronal acetylcholine receptor subunit alpha-6
Type:PROTEIN
Mol. Mass.:56943.53
Organism:Rattus norvegicus
Description:ChEMBL_1454451
Residue:493
BDBM50334474
NameBDBM50334474
Synonyms:1,1',1'',1'''-(5,5',5'',5'''-(benzene-1,2,4,5-tetrayl)tetrakis(pentane-5,1-diyl))tetrakis(3-(3-hydroxypropyl)pyridinium) bromide CHEMBL451671
TypeSmall organic molecule
Emp. Form.C58H86N4O4
Mol. Mass.903.3256
SMILESOCCCc1ccc[n+](CCCCCc2cc(CCCCC[n+]3cccc(CCCO)c3)c(CCCCC[n+]3cccc(CCCO)c3)cc2CCCCC[n+]2cccc(CCCO)c2)c1