Reaction Details
TargetCannabinoid receptor 1
LigandBDBM50334588
Substrate/Competitorn/a
Meas. Tech.ChEMBL_698534 (CHEMBL1647709)
Ki>3000±n/a nM
Citation El Bakali, JMuccioli, GGRenault, NPradal, DBody-Malapel, MDjouina, MHamtiaux, LAndrzejak, VDesreumaux, PChavatte, PLambert, DMMillet, R 4-Oxo-1,4-dihydropyridines as selective CB2 cannabinoid receptor ligands: structural insights into the design of a novel inverse agonist series. J Med Chem53:7918-31 (2010) 
 
Cannabinoid receptor 1
Name:Cannabinoid receptor 1
Type:G Protein-Coupled Receptor (GPCR)
Mol. Mass.:52868.96
Organism:Homo sapiens (Human)
Description:P21554
Residue:472
BDBM50334588
NameBDBM50334588
Synonyms:(R,S)-N3-(1-(1-Adamantyl)ethyl)-1,6-diphenyl-4-oxo-1,4-dihydropyridine-3-carboxamide | CHEMBL1641941
TypeSmall organic molecule
Emp. Form.C30H32N2O2
Mol. Mass.452.5873
SMILESCC(NC(=O)c1cn(-c2ccccc2)c(cc1=O)-c1ccccc1)C12CC3CC(CC(C3)C1)C2