Reaction Details
TargetCannabinoid receptor 2
LigandBDBM50334585
Substrate/Competitorn/a
Meas. Tech.ChEMBL_698535 (CHEMBL1647710)
Ki 29±n/a nM
Citation El Bakali, JMuccioli, GGRenault, NPradal, DBody-Malapel, MDjouina, MHamtiaux, LAndrzejak, VDesreumaux, PChavatte, PLambert, DMMillet, R 4-Oxo-1,4-dihydropyridines as selective CB2 cannabinoid receptor ligands: structural insights into the design of a novel inverse agonist series. J Med Chem53:7918-31 (2010) 
 
Cannabinoid receptor 2
Name:Cannabinoid receptor 2
Type:G Protein-Coupled Receptor (GPCR)
Mol. Mass.:39690.94
Organism:Homo sapiens (Human)
Description:P34972
Residue:360
BDBM50334585
NameBDBM50334585
Synonyms:CHEMBL1641937 | N3-(1-Adamantyl)-6-tert-butyl-1-pentyl-4-oxo-1,4-dihydropyridine-3-carboxamide
TypeSmall organic molecule
Emp. Form.C25H38N2O2
Mol. Mass.398.5814
SMILESCCCCCn1cc(C(=O)NC23CC4CC(CC(C4)C2)C3)c(=O)cc1C(C)(C)C