Reaction Details
TargetCannabinoid receptor 2
LigandBDBM50334578
Substrate/Competitorn/a
Meas. Tech.ChEMBL_698535 (CHEMBL1647710)
Ki 48±n/a nM
Citation El Bakali, JMuccioli, GGRenault, NPradal, DBody-Malapel, MDjouina, MHamtiaux, LAndrzejak, VDesreumaux, PChavatte, PLambert, DMMillet, R 4-Oxo-1,4-dihydropyridines as selective CB2 cannabinoid receptor ligands: structural insights into the design of a novel inverse agonist series. J Med Chem53:7918-31 (2010) 
 
Cannabinoid receptor 2
Name:Cannabinoid receptor 2
Type:G Protein-Coupled Receptor (GPCR)
Mol. Mass.:39690.94
Organism:Homo sapiens (Human)
Description:P34972
Residue:360
BDBM50334578
NameBDBM50334578
Synonyms:CHEMBL1641960 | N3-(Cyclohexyl)-1-pentyl-6-phenyl-4-thioxo-1,4-dihydropyridine-3-carboxamide
TypeSmall organic molecule
Emp. Form.C23H30N2OS
Mol. Mass.382.562
SMILESCCCCCn1cc(C(=O)NC2CCCCC2)c(=S)cc1-c1ccccc1