Reaction Details
TargetDual specificity calcium/calmodulin-dependent 3',5'-cyclic nucleotide phosphodiesterase 1B
LigandBDBM50334670
Substrate/Competitorn/a
Meas. Tech.ChEMBL_699036 (CHEMBL1646317)
IC50 10000±n/a nM
Citation Asproni, BMurineddu, GPau, APinna, GALanggård, MChristoffersen, CTNielsen, JKehler, J Synthesis and SAR study of new phenylimidazole-pyrazolo[1,5-c]quinazolines as potent phosphodiesterase 10A inhibitors. Bioorg Med Chem19:642-9 (2011) 
 
Dual specificity calcium/calmodulin-dependent 3',5'-cyclic nucleotide phosphodiesterase 1B
Name:Dual specificity calcium/calmodulin-dependent 3',5'-cyclic nucleotide phosphodiesterase 1B
Type:Enzyme
Mol. Mass.:61366.51
Organism:Homo sapiens (Human)
Description:n/a
Residue:536
BDBM50334670
NameBDBM50334670
Synonyms:2,9-Dimethyl-5-(2-(1-methyl-4-phenyl-1H-imidazol-2-yl)ethyl)pyrazolo[1,5-c]quinazoline | CHEMBL1642568
TypeSmall organic molecule
Emp. Form.C24H23N5
Mol. Mass.381.4729
SMILESCc1cc2c3cc(C)ccc3nc(CCc3nc(cn3C)-c3ccccc3)n2n1