Reaction Details
TargetcGMP-inhibited 3',5'-cyclic phosphodiesterase 3A
LigandBDBM50334653
Substrate/Competitorn/a
Meas. Tech.ChEMBL_699038 (CHEMBL1646319)
IC50 10000±n/a nM
Citation Asproni, BMurineddu, GPau, APinna, GALanggård, MChristoffersen, CTNielsen, JKehler, J Synthesis and SAR study of new phenylimidazole-pyrazolo[1,5-c]quinazolines as potent phosphodiesterase 10A inhibitors. Bioorg Med Chem19:642-9 (2011) 
 
cGMP-inhibited 3',5'-cyclic phosphodiesterase 3A
Name:cGMP-inhibited 3',5'-cyclic phosphodiesterase 3A
Type:Enzyme
Mol. Mass.:124966.46
Organism:Homo sapiens (Human)
Description:Q14432
Residue:1141
BDBM50334653
NameBDBM50334653
Synonyms:5-((1H-benzo[d]imidazol-2-yl)methylthio)-2-methyl-[1,2,4]triazolo[1,5-c]quinazoline CHEMBL1641615
TypeSmall organic molecule
Emp. Form.C18H14N6S
Mol. Mass.346.409
SMILESCc1nc2c3ccccc3nc(SCc3nc4ccccc4[nH]3)n2n1