Reaction Details
TargetPeroxisome proliferator-activated receptor delta
LigandBDBM50334843
Substrate/Competitorn/a
Meas. Tech.ChEMBL_699547 (CHEMBL1647802)
EC50 0.5±n/a nM
Citation Luckhurst, CAStein, LAFurber, MWebb, NRatcliffe, MJAllenby, GBotterell, STomlinson, WMartin, BWalding, A Discovery of isoindoline and tetrahydroisoquinoline derivatives as potent, selective PPARd agonists. Bioorg Med Chem Lett21:492-6 (2010) 
 
Peroxisome proliferator-activated receptor delta
Name:Peroxisome proliferator-activated receptor delta
Type:Enzyme
Mol. Mass.:49910.45
Organism:Homo sapiens (Human)
Description:Q03181
Residue:441
BDBM50334843
NameBDBM50334843
Synonyms:(R)-2-(4-((3-(2,4-dichlorophenylcarbamoyl)-3,4-dihydroisoquinolin-2(1H)-yl)methyl)-2-methylphenoxy)acetic acid | CHEMBL1643201
TypeSmall organic molecule
Emp. Form.C26H24Cl2N2O4
Mol. Mass.499.386
SMILESCc1cc(CN2Cc3ccccc3C[C@@H]2C(=O)Nc2ccc(Cl)cc2Cl)ccc1OCC(O)=O