Reaction Details
TargetCytochrome P450 11B1, mitochondrial
LigandBDBM50335343
Substrate/Competitorn/a
Meas. Tech.ChEMBL_701593 (CHEMBL1656352)
IC50 4±n/a nM
Citation Hille, UEZimmer, CVock, CAHartmann, RW First Selective CYP11B1 Inhibitors for the Treatment of Cortisol-Dependent Diseases ACS Med Chem Lett2:2-6 (2011) 
 
Cytochrome P450 11B1, mitochondrial
Name:Cytochrome P450 11B1, mitochondrial
Type:Enzyme
Mol. Mass.:57591.44
Organism:Homo sapiens (Human)
Description:P15538
Residue:503
BDBM50335343
NameBDBM50335343
Synonyms:1-(2,2,2-Triphenyl-ethyl)-1H-imidazole | CHEMBL1651508
TypeSmall organic molecule
Emp. Form.C23H20N2
Mol. Mass.324.4183
SMILESC(n1ccnc1)C(c1ccccc1)(c1ccccc1)c1ccccc1