Reaction Details
TargetCytochrome P450 11B1, mitochondrial
LigandBDBM50335344
Substrate/Competitorn/a
Meas. Tech.ChEMBL_701593 (CHEMBL1656352)
IC50 5±n/a nM
Citation Hille, UEZimmer, CVock, CAHartmann, RW First Selective CYP11B1 Inhibitors for the Treatment of Cortisol-Dependent Diseases ACS Med Chem Lett2:2-6 (2011) 
 
Cytochrome P450 11B1, mitochondrial
Name:Cytochrome P450 11B1, mitochondrial
Type:Enzyme
Mol. Mass.:57591.44
Organism:Homo sapiens (Human)
Description:P15538
Residue:503
BDBM50335344
NameBDBM50335344
Synonyms:1-Pentamethylphenylmethyl-1H-imidazole | CHEMBL1651495
TypeSmall organic molecule
Emp. Form.C15H20N2
Mol. Mass.228.3327
SMILESCc1c(C)c(C)c(Cn2ccnc2)c(C)c1C