Reaction Details
TargetCytochrome P450 11B1, mitochondrial
LigandBDBM7887
Substrate/Competitorn/a
Meas. Tech.ChEMBL_701593 (CHEMBL1656352)
IC50 135±n/a nM
Citation Hille, UEZimmer, CVock, CAHartmann, RW First Selective CYP11B1 Inhibitors for the Treatment of Cortisol-Dependent Diseases ACS Med Chem Lett2:2-6 (2011) 
 
Cytochrome P450 11B1, mitochondrial
Name:Cytochrome P450 11B1, mitochondrial
Type:Enzyme
Mol. Mass.:57591.44
Organism:Homo sapiens (Human)
Description:P15538
Residue:503
BDBM7887
NameBDBM7887
Synonyms:1-Benzylimidazole (BI) 1-benzylimidazole US9138393, 1-benzylimidazole
TypeSmall organic molecule
Emp. Form.C10H10N2
Mol. Mass.158.1998
SMILESC(c1ccccc1)n1ccnc1